Target
Integrin alpha-4/beta-1 [T112H]
Ligand
BDBM17198
Substrate
VCAM-1
Meas. Tech.
Cell Adhesion Assay (alpha4beta1 Mediated Adhesion/VCAM-1)
pH
7.4±n/a
Temperature
295.15±n/a K
IC50
20±n/a nM
Citation
 Lassoie, MABroeders, FCollart, PDefrère, Lde Laveleye-Defais, FDemaude, TGassama, AGuillaumet, GHayez, JCKiss, LKnerr, LNicolas, JMNorsikian, SQuéré, LRoutier, SVerbois, VProvins, L 2,6-Quinolinyl derivatives as potent VLA-4 antagonists. Bioorg Med Chem Lett 17:142-6 (2007)  
Target
Name:
Integrin alpha-4/beta-1 [T112H]
Synonyms:
CD49d/CD29 Very Late Antigen-4
Type:
Protein Complex
Mol. Mass.:
Description:
The assay uses transfected Ramos cells expressing alpha4beta1 integrin.
Components:
This complex has 2 components.
Component 1
Name:
Integrin alpha-4
Synonyms:
CD49 antigen-like family member D CD49d antigen ITA4_HUMAN Integrin alpha-4 Integrin alpha-IV VLA-4 integrin alpha 4 precursor | integrin alpha-4 precursor
Type:
Membrane Protein
Mol. Mass.:
114897.35
Organism:
Homo sapiens (Human)
Description:
P13612
Residue:
1032
  
Component 2
Name:
Integrin beta-1 [T112H]
Synonyms:
CD29 antigen Fibronectin receptor subunit beta ITGB1 Integrin beta1 MSK12
Type:
Membrane Protein
Mol. Mass.:
88450.95
Organism:
Homo sapiens (Human)
Description:
P05556[T112H]
Residue:
798
  
Inhibitor
Name:
BDBM17198
Synonyms:
2,6-quinolinyl derivative, 20 | 2-[(2,6-dichlorophenyl)formamido]-3-[2-(2,6-dimethoxyphenyl)quinolin-6-yl]propanoic acid
Type:
Small organic molecule
Emp. Form.:
C27H22Cl2N2O5
Mol. Mass.:
525.38
SMILES:
COc1cccc(OC)c1-c1ccc2cc(CC(NC(=O)c3c(Cl)cccc3Cl)C(O)=O)ccc2n1
:
Substrate
Name:
Vascular cell adhesion protein 1
Synonyms:
CD106 antigen VCAM-1 VCAM1_HUMAN Vascular cell adhesion protein 1 (VCAM-1) | Vascular cell adhesion protein 1 precursor
Type:
Other Protein Type
Mol. Mass.:
81259.16
Organism:
Homo sapiens (Human)
Description:
P19320
Residue:
739