Target
Integrin alpha-4/beta-1 [T112H]
Ligand
BDBM17222
Substrate
VCAM-1
Meas. Tech.
Ramos Cell Adhesion Assay (alpha4beta1 Mediated Adhesion/VCAM-1)
pH
7.4±n/a
Temperature
296.15±n/a K
IC50
36±9 nM
Citation
 Lawson, ECSantulli, RJDyatkin, ABBallentine, SAAbraham, WMRudman, SPage, CPde Garavilla, LDamiano, BPKinney, WAMaryanoff, BE Selection of a 2-azabicyclo[2.2.2]octane-based alpha4beta1 integrin antagonist as an inhaled anti-asthmatic agent. Bioorg Med Chem 14:4208-16 (2006)  
Target
Name:
Integrin alpha-4/beta-1 [T112H]
Synonyms:
CD49d/CD29 Very Late Antigen-4
Type:
Protein Complex
Mol. Mass.:
Description:
The assay uses transfected Ramos cells expressing alpha4beta1 integrin.
Components:
This complex has 2 components.
Component 1
Name:
Integrin alpha-4
Synonyms:
CD49 antigen-like family member D CD49d antigen ITA4_HUMAN Integrin alpha-4 Integrin alpha-IV VLA-4 integrin alpha 4 precursor | integrin alpha-4 precursor
Type:
Membrane Protein
Mol. Mass.:
114897.35
Organism:
Homo sapiens (Human)
Description:
P13612
Residue:
1032
  
Component 2
Name:
Integrin beta-1 [T112H]
Synonyms:
CD29 antigen Fibronectin receptor subunit beta ITGB1 Integrin beta1 MSK12
Type:
Membrane Protein
Mol. Mass.:
88450.95
Organism:
Homo sapiens (Human)
Description:
P05556[T112H]
Residue:
798
  
Inhibitor
Name:
BDBM17222
Synonyms:
(2S)-2-{[(3S)-2-(benzenesulfonyl)-2-azabicyclo[2.2.2]octan-3-yl]formamido}-3-[4-(pyridine-4-amido)phenyl]propanoic acid CHEMBL153987
Type:
Small organic molecule
Emp. Form.:
C29H30N4O6S
Mol. Mass.:
562.637
SMILES:
OC(=O)[C@H](Cc1ccc(NC(=O)c2ccncc2)cc1)NC(=O)[C@@H]1C2CCC(CC2)N1S(=O)(=O)c1ccccc1
:
Substrate
Name:
Vascular cell adhesion protein 1
Synonyms:
CD106 antigen VCAM-1 VCAM1_HUMAN Vascular cell adhesion protein 1 (VCAM-1) | Vascular cell adhesion protein 1 precursor
Type:
Other Protein Type
Mol. Mass.:
81259.16
Organism:
Homo sapiens (Human)
Description:
P19320
Residue:
739