Target
Serine protease 1
Ligand
BDBM17280
Substrate
BDBM17139
Meas. Tech.
Enzyme Inhibition Assay
pH
7.5±n/a
Temperature
295.15±n/a K
Ki
170±n/a nM
Citation
 Adler, MDavey, DDPhillips, GBKim, SHJancarik, JRumennik, GLight, DRWhitlow, M Preparation, characterization, and the crystal structure of the inhibitor ZK-807834 (CI-1031) complexed with factor Xa. Biochemistry 39:12534-42 (2000)  
Target
Name:
Serine protease 1
Synonyms:
Beta-Trypsin PRSS1 TRY1 TRYP1 Trypsin I
Type:
Enzyme
Mol. Mass.:
25790.52
Organism:
Bos taurus (bovine)
Description:
P00760
Residue:
246
  
Inhibitor
Name:
BDBM17280
Synonyms:
1-[2-(5-carbamimidoyl-2-hydroxyphenoxy)-3,5-difluoro-6-[3-(1-methyl-4,5-dihydro-1H-imidazol-2-yl)phenoxy]pyridin-4-yl]piperidine-3-carboxylic acid | Pyridine template, V
Type:
Small organic molecule
Emp. Form.:
C28H28F2N6O5
Mol. Mass.:
566.5559
SMILES:
CN1CCN=C1c1cccc(Oc2nc(Oc3cc(ccc3O)C(N)=N)c(F)c(N3CCCC(C3)C(O)=O)c2F)c1
:
Substrate
Name:
BDBM17139
Synonyms:
(2S)-2-[(2R)-2-amino-3-methylbutanamido]-N-[(1S)-4-carbamimidamido-1-[(4-nitrophenyl)carbamoyl]butyl]-4-methylpentanamide dihydrochloride H-D-Val-Leu-Arg-pNA ¿¿¿¿ 2HCl H-D-Valyl-L-leucyl-L-argininep-Nitroaniline dihydrochloride
Type:
Small organic molecule
Emp. Form.:
C23H38N8O5
Mol. Mass.:
506.5984
SMILES:
CC(C)CC(NC(=O)C(N)C(C)C)C(=O)NC(CCC\[NH+]=C(/N)[NH-])C(=O)Nc1ccc(cc1)[N+]([O-])=O
: