Target
17-beta-hydroxysteroid dehydrogenase type 1
Ligand
BDBM17291
Substrate
BDBM17289
Meas. Tech.
Enzymatic Assay (Inhibition of Type 1 17beta-HSD)
pH
7.4±n/a
Temperature
310.15±n/a K
IC50
140±n/a nM
Citation
 Qiu, WCampbell, RLGangloff, ADupuis, PBoivin, RPTremblay, MRPoirier, DLin, SX A concerted, rational design of type 1 17beta-hydroxysteroid dehydrogenase inhibitors: estradiol-adenosine hybrids with high affinity. FASEB J 16:1829-31 (2002)  
Target
Name:
17-beta-hydroxysteroid dehydrogenase type 1
Synonyms:
17-beta-HSD 1 17-beta-hydroxysteroid dehydrogenase type 1 20-alpha-HSD E17KSR EDH17B1 EDHB17 Estradiol 17-beta-dehydrogenase 1 (17beta-HSD1) Placental 17-beta-hydroxysteroid dehydrogenase | SDR28C1
Type:
Enzyme
Mol. Mass.:
34945.13
Organism:
Homo sapiens (Human)
Description:
P14061
Residue:
328
  
Inhibitor
Name:
BDBM17291
Synonyms:
E2-adenosine hybrid compound, 9 | [5-(6-amino-9H-purin-9-yl)-3,4-dihydroxyoxolan-2-yl]methyl 10-[(1S,10R,11S,14S,15S)-5,14-dihydroxy-15-methyltetracyclo[8.7.0.0^{2,7}.0^{11,15}]heptadeca-2,4,6-trien-13-yl]decanoate
Type:
Emp. Form.:
C38H53N5O7
Mol. Mass.:
691.8567
SMILES:
[H][C@@]12CC(CCCCCCCCCC(=O)OCC3OC(C(O)C3O)n3cnc4c(N)ncnc34)[C@H](O)[C@@]1(C)CC[C@]1([H])c3ccc(O)cc3CC[C@@]21[H]
:
Substrate
Name:
BDBM17289
Synonyms:
(1S,10R,11S,15S)-5-hydroxy-15-methyltetracyclo[8.7.0.0^{2,7}.0^{11,15}]heptadeca-2,4,6-trien-14-one Estrone Estrone, 15 Kestrone Unigen [2,4,6,7-3H]-Estrone | folliculin
Type:
Steroid
Emp. Form.:
C18H22O2
Mol. Mass.:
270.3661
SMILES:
[H][C@@]12CCC(=O)[C@@]1(C)CC[C@]1([H])c3ccc(O)cc3CC[C@@]21[H]
: