Target
E3 ubiquitin-protein ligase XIAP [241-356]
Ligand
BDBM17339
Substrate
BDBM17337
Meas. Tech.
Competitive Fluorescent-binding Assay
pH
7±n/a
Temperature
295.15±n/a K
Kd
120000±60000 nM
Citation
 Wist, ADGu, LRiedl, SJShi, YMcLendon, GL Structure-activity based study of the Smac-binding pocket within the BIR3 domain of XIAP. Bioorg Med Chem 15:2935-43 (2007)  
Target
Name:
E3 ubiquitin-protein ligase XIAP [241-356]
Synonyms:
API3 BIRC4 E3 ubiquitin-protein ligase XIAP BIR-3 IAP3 X-linked inhibitor of apoptosis protein BIR3 domain (XIAP BIR-3) XIAP-BIR3 baculovirus IAP repeat 3 (BIR3) domain of XIAP
Type:
Protein Binding Domain
Mol. Mass.:
13276.62
Organism:
Homo sapiens (Human)
Description:
BIR3 of XIAP: RESIDUES 241-356.
Residue:
116
  
Inhibitor
Name:
BDBM17339
Synonyms:
(2S)-2-{[(2S)-1-({2-[(1S)-1-aminoethyl]-1,3-oxazol-4-yl}carbonyl)pyrrolidin-2-yl]formamido}-3-(4-hydroxyphenyl)propanoic acid | AoxSPY
Type:
Small organic molecule
Emp. Form.:
C20H24N4O6
Mol. Mass.:
416.4278
SMILES:
C[C@H](N)c1nc(co1)C(=O)N1CCC[C@H]1C(=O)N[C@@H](Cc1ccc(O)cc1)C(O)=O
:
Substrate
Name:
BDBM17337
Synonyms:
3-({2-[6-(dimethylamino)naphthalen-2-yl]-2-oxoethyl}sulfanyl)-2-({1-[2-(1-formamidoethan-1-aminium)-3-methylbutanoyl]pyrrolidin-2-yl}formamido)propanoate | AVPC-BADAN
Type:
Fluorescent dye-conjugated peptide
Emp. Form.:
C30H41N5O6S
Mol. Mass.:
599.741
SMILES:
CC(C)C(NC(=O)C(C)[NH3+])C(=O)N1CCCC1C(=O)NC(CSCC(=O)c1ccc2cc(ccc2c1)N(C)C)C([O-])=O
: