Target
Complex of Baculoviral IAP repeat-containing protein 7 [1-159,S150G] and E3 ubiquitin-protein ligase XIAP [336-348]
Ligand
BDBM17344
Substrate
BDBM17342
Meas. Tech.
Fluorescence Polarization Affinity Measurements.
pH
7.2±n/a
Temperature
295.15±n/a K
Ki
40±n/a nM
Citation
 Zobel, KWang, LVarfolomeev, EFranklin, MCElliott, LOWallweber, HJOkawa, DCFlygare, JAVucic, DFairbrother, WJDeshayes, K Design, synthesis, and biological activity of a potent Smac mimetic that sensitizes cancer cells to apoptosis by antagonizing IAPs. ACS Chem Biol 1:525-33 (2006)  
Target
Name:
Complex of Baculoviral IAP repeat-containing protein 7 [1-159,S150G] and E3 ubiquitin-protein ligase XIAP [336-348]
Synonyms:
Chimeric protein of melanoma inhibitor of apoptosis protein and XIAP-BIR3 MLXBIR3SG
Type:
Chimeric Protein
Mol. Mass.:
19011.07
Organism:
Homo sapiens (Human)
Description:
Amino acids 160-179 of MLBIR were replaced with amino acids 336-348 of XIAP-BIR3, and Ser150 of MLBIR was mutated to glycine to give MLXBIR3SG.
Residue:
172
  
Inhibitor
Name:
BDBM17344
Synonyms:
(2S)-2-{[(2S)-1-[(2S)-2-[(2S)-2-aminopropanamido]-3-methylbutanoyl]pyrrolidin-2-yl]formamido}-3-(1H-indol-3-yl)propanoic acid L-alanyl-L-valyl-L-prolyl-L-tryptophan
Type:
Polypeptide
Emp. Form.:
C24H33N5O5
Mol. Mass.:
471.5493
SMILES:
CC(C)[C@H](NC(=O)[C@H](C)N)C(=O)N1CCC[C@H]1C(=O)N[C@@H](Cc1c[nH]c2ccccc12)C(O)=O
:
Substrate
Name:
BDBM17342
Synonyms:
5-carboxyflourescein(5-FAM)-conjugated AVPFFAKK | AVP-diPhe-FAM
Type:
Fluorescent dye-conjugated peptide
Emp. Form.:
Mol. Mass.:
SMILES:
: