Target
High affinity nerve growth factor receptor
Ligand
BDBM356158
Substrate
Meas. Tech.
Functional Activity Assay
IC50
7.50±n/a nM
Citation
 Mitchell, HFraley, MECooke, AJStump, CAChen, YZhang, XMcComas, CCSchirripa, KMcWherter, MMercer, SPBabaoglu, KMeng, DWu, JLiu, PWood, HBBao, JLi, CSMao, QQi, Z TrkA kinase inhibitors, compositions and methods thereof US Patent  US9815846 Publication Date 11/14/2017 
Target
Name:
High affinity nerve growth factor receptor
Synonyms:
2.7.10.1 NTRK1 NTRK1_HUMAN Neurotrophic tyrosine kinase receptor type 1 Synonyms=MTC TRK1-transforming tyrosine kinase protein TRKA GN Tropomyosin alpha-3 chain/High affinity nerve growth factor receptor Tropomyosin-related kinase A (TrkA) Tyrosine kinase receptor (Trk) Tyrosine kinase receptor A (Trk A) Tyrosine kinase receptor A (TrkA) p140-TrkA
Type:
Mol. Mass.:
87498.18
Organism:
Homo sapiens (Human)
Description:
P04629
Residue:
796
  
Inhibitor
Name:
BDBM356158
Synonyms:
N-(6-(2-hydroxyethyl)-2-phenyl- 5,6,7,8-tetrahydro-1,6- naphthyridin-3-yl)-3-(1-methyl- 1H-pyrazol-3-yl)-4- (trifluoromethyl)benzamide | US9815846, Compound 158
Type:
Small organic molecule
Emp. Form.:
C28H26F3N5O2
Mol. Mass.:
521.5335
SMILES:
Cn1ccc(n1)-c1cc(ccc1C(F)(F)F)C(=O)Nc1cc2CN(CCO)CCc2nc1-c1ccccc1
: