Target
C-X-C chemokine receptor type 3
Ligand
BDBM228174
Substrate
Meas. Tech.
Receptor Internalization Assay (RIA)
IC50
299±n/a nM
Citation
 Caroff, EMeyer, E (R)-2-methyl-piperazine derivatives as CXCR3 receptor modulators US Patent  US10047080 Publication Date 8/14/2018 
Target
Name:
C-X-C chemokine receptor type 3
Synonyms:
AAO92295.1 C-X-C chemokine receptor type 3 (CXCR3) CXCR3 CXCR3_HUMAN chemokine (C-X-C motif) receptor 3
Type:
Enzyme Catalytic Domain
Mol. Mass.:
40665.65
Organism:
Homo sapiens (Human)
Description:
Residue:
368
  
Inhibitor
Name:
BDBM228174
Synonyms:
1-{(R)-4-[4-(2-Ethoxy-pyrimidin-5-yl)-2-trifluoromethyl-thiazol-5-yl]-2-methyl-piperazin-1-yl}-2-(3-isopropyl-[1,2,4]triazol-1-yl)-ethanone | US10047080, 1
Type:
Small organic molecule
Emp. Form.:
C23H28F3N7O2S
Mol. Mass.:
523.574
SMILES:
CCOc1ncc(cn1)-c1cc(sc1C1CNCC(C)N1C(=O)Cn1cnc(n1)C(C)C)C(F)(F)F
: