Target
C-X-C chemokine receptor type 3
Ligand
BDBM228187
Substrate
Meas. Tech.
Receptor Internalization Assay (RIA)
IC50
830±n/a nM
Citation
 Caroff, EMeyer, E (R)-2-methyl-piperazine derivatives as CXCR3 receptor modulators US Patent  US10047080 Publication Date 8/14/2018 
Target
Name:
C-X-C chemokine receptor type 3
Synonyms:
AAO92295.1 C-X-C chemokine receptor type 3 (CXCR3) CXCR3 CXCR3_HUMAN chemokine (C-X-C motif) receptor 3
Type:
Enzyme Catalytic Domain
Mol. Mass.:
40665.65
Organism:
Homo sapiens (Human)
Description:
Residue:
368
  
Inhibitor
Name:
BDBM228187
Synonyms:
2-[3-(1-Hydroxy-1-methyl-ethyl)-[1,2,4]triazol-1-yl]-1-{(R)-2-methyl-4-[2-trifluoromethyl-4-(2-trifluoromethyl-pyrimidin-5-yl)-thiazol-5-yl]-piperazin-1-yl}-ethanone | US10047080, 13
Type:
Small organic molecule
Emp. Form.:
C22H23F6N7O2S
Mol. Mass.:
563.519
SMILES:
CC1CNCC(N1C(=O)Cn1cnc(n1)C(C)(C)O)c1sc(cc1-c1cnc(nc1)C(F)(F)F)C(F)(F)F
: