Target
Glutamate carboxypeptidase 2 [44-750]
Ligand
BDBM17664
Substrate
BDBM17658
Meas. Tech.
Determination of Inhibition Concentration Values (IC50)
pH
7.4±n/a
Temperature
310.15±n/a K
IC50
523000±n/a nM
Citation
 Barinka, CRovenská, MMlcochová, PHlouchová, KPlechanovová, AMajer, PTsukamoto, TSlusher, BSKonvalinka, JLubkowski, J Structural insight into the pharmacophore pocket of human glutamate carboxypeptidase II. J Med Chem 50:3267-73 (2007)  
Target
Name:
Glutamate carboxypeptidase 2 [44-750]
Synonyms:
FOLH FOLH1_HUMAN Folylpoly-gamma-glutamate carboxypeptidase Glutamate carboxypeptidase 2 NAALAD1 PSMA Prostate-specific membrane antigen (PSMA) mGCP
Type:
Enzyme
Mol. Mass.:
79524.51
Organism:
Homo sapiens (Human)
Description:
The extracellular domain of human glutamate carboxypeptidase II (rhGCPII, amino acids 44-750) was overexpressed in Drosophila Schneider S2 cells and purified to homogeneity.
Residue:
707
  
Inhibitor
Name:
BDBM17664
Synonyms:
(2S)-2-amino-3-(phosphonooxy)propanoic acid L-SOP | L-serine O-phosphate
Type:
Small organic molecule
Emp. Form.:
C3H8NO6P
Mol. Mass.:
185.0725
SMILES:
N[C@@H](COP(O)(O)=O)C(O)=O
:
Substrate
Name:
BDBM17658
Synonyms:
(2S)-2-[(3S)-3-acetamido-3-formamidopropanoic acid]pentanedioic acid NAAG | [3H]NAAG
Type:
Small organic molecule
Emp. Form.:
C11H16N2O8
Mol. Mass.:
304.2533
SMILES:
CC(=O)N[C@@H](CC(O)=O)C(=O)N[C@@H](CCC(O)=O)C(O)=O
: