Target
Vascular endothelial growth factor receptor 2
Ligand
BDBM17681
Substrate
Gastrin Peptide Substrate
Meas. Tech.
HTRF Kinase Inhibition Assay
pH
7.5±n/a
Temperature
295.15±n/a K
Ki
48±n/a nM
Citation
 Potashman, MHBready, JCoxon, ADemelfi, TMDipietro, LDoerr, NElbaum, DEstrada, JGallant, PGermain, JGu, YHarmange, JCKaufman, SAKendall, RKim, JLKumar, GNLong, AMNeervannan, SPatel, VFPolverino, ARose, PPlas, SVWhittington, DZanon, RZhao, H Design, Synthesis, and Evaluation of Orally Active Benzimidazoles and Benzoxazoles as Vascular Endothelial Growth Factor-2 Receptor Tyrosine Kinase Inhibitors. J Med Chem 50:4351-4373 (2007)  
Target
Name:
Vascular endothelial growth factor receptor 2
Synonyms:
CD_antigen=CD309 Fetal liver kinase 1 (FLK-1) KDR Protein-tyrosine kinase receptor Flk-1 VEGFR-2 VEGFR2 Vascular Endothelial Growth Factor Receptor Kinase 2 Vascular endothelial growth factor receptor 2 (KDR) Vascular endothelial growth factor receptor 2 (VEGFR2) Vascular endothelial growth factor receptor-2 (VEGFR-2)
Type:
Receptor Tyrosine Kinase
Mol. Mass.:
151510.97
Organism:
Homo sapiens (Human)
Description:
P35968
Residue:
1356
  
Inhibitor
Name:
BDBM17681
Synonyms:
2-aminobenzimidazole, 6 | N-[4-chloro-3-(trifluoromethyl)phenyl]-5-{1H-pyrrolo[2,3-b]pyridin-4-yloxy}-1H-1,3-benzodiazol-2-amine
Type:
Small organic molecule
Emp. Form.:
C21H13ClF3N5O
Mol. Mass.:
443.809
SMILES:
FC(F)(F)c1cc(Nc2nc3ccc(Oc4ccnc5[nH]ccc45)cc3[nH]2)ccc1Cl
:
Substrate
Name:
Gastrin Peptide Substrate
Synonyms:
Biotinylated gastrin peptide substrate gastrin substrate
Type:
Peptide
Mol. Mass.:
1823.88
Organism:
Description:
Residue:
15
ITINEEEEAYGWLDF