Target
Apoptosis regulator Bcl-2
Ligand
BDBM189804
Substrate
Meas. Tech.
TR-FRET (Time-Resolved Fluorescence-Resonance-Energy-Transfer) assay
Ki
<0.001±n/a nM
Citation
 Catron, NLindley, DMiller, JMSchmitt, EATong, P Solid dispersions containing an apoptosis-inducing agent US Patent  US10213433 Publication Date 2/26/2019 
Target
Name:
Apoptosis regulator Bcl-2
Synonyms:
Apoptosis regulator Bcl-2 Protein BCL-2 BCL2_HUMAN | Bcl-2 Protein
Type:
Homodimer or heterodimer
Mol. Mass.:
26269.11
Organism:
Homo sapiens (Human)
Description:
P10415
Residue:
239
  
Inhibitor
Name:
BDBM189804
Synonyms:
US10213433, Compound 378 US9174982, 378
Type:
Small organic molecule
Emp. Form.:
C45H50ClN7O8S
Mol. Mass.:
884.439
SMILES:
COC1(C)CCC(=C(CN2CCN(CC2)c2ccc(C(=O)NS(=O)(=O)c3ccc(NCC4CCOCC4)c(c3)[N+]([O-])=O)c(Oc3cnc4[nH]ccc4c3)c2)C1)c1ccc(Cl)cc1
: