Target
Tyrosine-protein kinase Lck
Ligand
BDBM17730
Substrate
biotinylated gastrin substrate
Meas. Tech.
HTRF Kinase Inhibition Assay
pH
7.5±n/a
Temperature
295.15±n/a K
IC50
1±n/a nM
Citation
 Martin, MWNewcomb, JNunes, JJMcGowan, DCArmistead, DMBoucher, CBuchanan, JLBuckner, WChai, LElbaum, DEpstein, LFFaust, TFlynn, SGallant, PGore, AGu, YHsieh, FHuang, XLee, JHMetz, DMiddleton, SMohn, DMorgenstern, KMorrison, MJNovak, PMOliveira-dos-Santos, APowers, DRose, PSchneider, SSell, STudor, YTurci, SMWelcher, AAWhite, RDZack, DZhao, HZhu, LZhu, XGhiron, CAmouzegh, PErmann, MJenkins, JJohnston, DNapier, SPower, E Novel 2-aminopyrimidine carbamates as potent and orally active inhibitors of Lck: synthesis, SAR, and in vivo antiinflammatory activity. J Med Chem 49:4981-91 (2006)  
Target
Name:
Tyrosine-protein kinase Lck
Synonyms:
2.7.10.2 LCK_HUMAN Leukocyte C-terminal Src kinase Lymphocyte-specific protein tyrosine kinase Protein YT16 Proto-oncogene tyrosine-protein kinase LCK T cell-specific protein-tyrosine kinase
Type:
Mol. Mass.:
57987.83
Organism:
Homo sapiens (Human)
Description:
P06239
Residue:
509
  
Inhibitor
Name:
BDBM17730
Synonyms:
2,6-dimethylphenyl N-[(2,5-dimethoxyphenyl)methyl]-N-(2-{[4-(4-methylpiperazin-1-yl)phenyl]amino}pyrimidin-4-yl)carbamate | 2-aminopyrimidine carbamate, 29
Type:
Small organic molecule
Emp. Form.:
C33H38N6O4
Mol. Mass.:
582.6926
SMILES:
COc1ccc(OC)c(CN(C(=O)Oc2c(C)cccc2C)c2ccnc(Nc3ccc(cc3)N3CCN(C)CC3)n2)c1
:
Substrate
Name:
biotinylated gastrin substrate
Synonyms:
Type:
Peptide
Mol. Mass.:
2100.22
Organism:
Description:
Residue:
17
ITINYLEEEEAYGWLDF