Target
Glutamate carboxypeptidase 2 [44-750]
Ligand
BDBM17659
Substrate
BDBM17658
Meas. Tech.
Microplate GCPII Radioactivity-Based Assay
pH
7.4±n/a
Temperature
310.15±n/a K
IC50
0.3±n/a nM
Km
130±40 nM
kcat
4±2 1/sec
Citation
 Tsukamoto, TMajer, PVitharana, DNi, CHin, BLu, XCThomas, AGWozniak, KMCalvin, DCWu, YSlusher, BSScarpetti, DBonneville, GW Enantiospecificity of glutamate carboxypeptidase II inhibition. J Med Chem 48:2319-24 (2005)  
Target
Name:
Glutamate carboxypeptidase 2 [44-750]
Synonyms:
FOLH FOLH1_HUMAN Folylpoly-gamma-glutamate carboxypeptidase Glutamate carboxypeptidase 2 NAALAD1 PSMA Prostate-specific membrane antigen (PSMA) mGCP
Type:
Enzyme
Mol. Mass.:
79524.51
Organism:
Homo sapiens (Human)
Description:
The extracellular domain of human glutamate carboxypeptidase II (rhGCPII, amino acids 44-750) was overexpressed in Drosophila Schneider S2 cells and purified to homogeneity.
Residue:
707
  
Inhibitor
Name:
BDBM17659
Synonyms:
(R,S)-2-phosphonomethylpentanedioic acid 2-PMPA US10894807, ID P009 | pentanedioic acid analogue, (RS)-1
Type:
Small organic molecule
Emp. Form.:
C6H11O7P
Mol. Mass.:
226.1211
SMILES:
OC(=O)CCC(CP(O)(O)=O)C(O)=O
:
Substrate
Name:
BDBM17658
Synonyms:
(2S)-2-[(3S)-3-acetamido-3-formamidopropanoic acid]pentanedioic acid NAAG | [3H]NAAG
Type:
Small organic molecule
Emp. Form.:
C11H16N2O8
Mol. Mass.:
304.2533
SMILES:
CC(=O)N[C@@H](CC(O)=O)C(=O)N[C@@H](CCC(O)=O)C(O)=O
: