Target
Androgen receptor
Ligand
BDBM18168
Substrate
BDBM18161
Meas. Tech.
Receptor Binding and Transactivation Assay
pH
7.4±n/a
Temperature
295.15±n/a K
Ki
2.1±n/a nM
EC50
1.5±n/a nM
Comments
Intrinsic relative activity to DHT is 101%.
Citation
 Sun, CRobl, JAWang, TCHuang, YKuhns, JELupisella, JABeehler, BCGolla, RSleph, PGSeethala, RFura, AKrystek, SrAn, YMalley, MFSack, JSSalvati, MEGrover, GJOstrowski, JHamann, LG Discovery of potent, orally-active, and muscle-selective androgen receptor modulators based on an N-aryl-hydroxybicyclohydantoin scaffold. J Med Chem 49:7596-9 (2006)  
Target
Name:
Androgen receptor
Synonyms:
ANDR_HUMAN Androgen Receptor Androgen receptor/Baculoviral IAP repeat-containing protein 2 Dihydrotestosterone receptor Nuclear receptor subfamily 3 group C member 4
Type:
Receptor
Mol. Mass.:
99185.27
Organism:
Homo sapiens (Human)
Description:
CHO cells were stably transfected with human AR gene.
Residue:
920
  
Inhibitor
Name:
BDBM18168
Synonyms:
(7R,7aS)-7-hydroxy-2-(4-nitronaphthalen-1-yl)-hexahydro-1H-pyrrolo[1,2-a]imidazolidine-1,3-dione | N-aryl-bicyclic hydantoin, (-)10a
Type:
Small organic molecule
Emp. Form.:
C16H13N3O5
Mol. Mass.:
327.2915
SMILES:
O[C@@H]1CCn2c1c(O)n(-c1ccc([N+]([O-])=O)c3ccccc13)c2=O
:
Substrate
Name:
BDBM18161
Synonyms:
(1S,2S,7S,10R,11S,14S,15S)-14-hydroxy-2,15-dimethyltetracyclo[8.7.0.0^{2,7}.0^{11,15}]heptadecan-5-one CHEMBL27769 Dihydrotestosterone | [3H]DHT
Type:
Steroid
Emp. Form.:
C19H30O2
Mol. Mass.:
290.4403
SMILES:
[H][C@@]12CC[C@H](O)[C@@]1(C)CC[C@@]1([H])[C@@]2([H])CC[C@@]2([H])CC(=O)CC[C@]12C
: