Target
Phosphatidylinositol 4,5-bisphosphate 3-kinase catalytic subunit delta isoform
Ligand
BDBM357978
Substrate
Meas. Tech.
ADP-Glo Format PI3K Assay
IC50
4.00±n/a nM
Citation
 Bhide, RSBatt, DGCherney, RJCornelius, LALiu, QMarcoux, DNeels, JPoss, MARuan, ZShi, QSrivastava, ASQin, LTino, JAWatterson, SH Bicyclic heteroaryl amine compounds US Patent  US10214537 Publication Date 2/26/2019 
Target
Name:
Phosphatidylinositol 4,5-bisphosphate 3-kinase catalytic subunit delta isoform
Synonyms:
PI3-kinase p110 subunit delta PI3-kinase subunit p110-delta PIK3CD Phosphatidylinositol 4,5-biphosphate 3-kinase catalytic subunit delta (PIK3CD) Phosphatidylinositol 4,5-bisphosphate 3-kinase 110 kDa catalytic subunit delta (PI3K delta) Phosphatidylinositol 4,5-bisphosphate 3-kinase catalytic subunit delta (PI3Kdelta) Phosphatidylinositol 4,5-bisphosphate 3-kinase catalytic subunit delta isoform (PI3K delta) Phosphatidylinositol 4,5-bisphosphate 3-kinase catalytic subunit delta isoform (PI3K-delta) Phosphatidylinositol 4,5-bisphosphate 3-kinase catalytic subunit delta isoform (PI3Kdelta)
Type:
Enzyme Subunit
Mol. Mass.:
119489.41
Organism:
Homo sapiens (Human)
Description:
O00329
Residue:
1044
  
Inhibitor
Name:
BDBM357978
Synonyms:
(3-(4-amino-5-(1-cyclohexyl-1H-pyrazol-5-yl) pyrrolo[2,1-f][1,2,4]triazin-7-yl)phenyl)(1,1- dioxidothiomorpholino)methanone | US10214537, Example 46
Type:
Small organic molecule
Emp. Form.:
C26H29N7O3S
Mol. Mass.:
519.619
SMILES:
Nc1ncnn2c(cc(-c3ccnn3C3CCCCC3)c12)-c1cccc(c1)C(=O)N1CCS(=O)(=O)CC1
: