Target
Bifunctional dihydrofolate reductase-thymidylate synthase
Ligand
BDBM18512
Substrate
BDBM18044
Meas. Tech.
Inhibitor Screening Using Bacterial System (IC50) and Measurement of Inhibition Constant (Ki)
pH
7±n/a
Temperature
298.15±n/a K
Ki
0.21±0.03 nM
IC50
180±50 nM
Citation
 Bunyarataphan, SLeartsakulpanich, UTaweechai, STarnchompoo, BKamchonwongpaisan, SYuthavong, Y Evaluation of the activities of pyrimethamine analogs against Plasmodium vivax and Plasmodium falciparum dihydrofolate reductase-thymidylate synthase using in vitro enzyme inhibition and bacterial complementation assays. Antimicrob Agents Chemother 50:3631-7 (2006)  
Target
Name:
Bifunctional dihydrofolate reductase-thymidylate synthase
Synonyms:
DRTS_PLAVI PvDHFR-TS
Type:
Enzyme
Mol. Mass.:
71083.97
Organism:
Plasmodium vivax (malaria parasite P. vivax)
Description:
O02604
Residue:
623
  
Inhibitor
Name:
BDBM18512
Synonyms:
5-(4-chlorophenyl)-6-ethylpyrimidine-2,4-diamine Pyrimethamine (Pyr) cid_4993
Type:
Small organic molecule
Emp. Form.:
C12H13ClN4
Mol. Mass.:
248.711
SMILES:
CCc1nc(N)nc(N)c1-c1ccc(Cl)cc1
:
Substrate
Name:
BDBM18044
Synonyms:
(2S)-2-[(4-{[(2-amino-4-oxo-1,4,7,8-tetrahydropteridin-6-yl)methyl]amino}phenyl)formamido]pentanedioic acid dihydrofolic acid
Type:
Small organic molecule
Emp. Form.:
C19H21N7O6
Mol. Mass.:
443.4133
SMILES:
Nc1nc2NCC(CNc3ccc(cc3)C(=O)N[C@@H](CCC(O)=O)C(O)=O)=Nc2c(=O)[nH]1
: