Target
Bifunctional dihydrofolate reductase-thymidylate synthase
Ligand
BDBM18512
Substrate
BDBM18044
Meas. Tech.
Antimalarial Testing In Vitro (IC50) and Measurement of Inhibition Constant (Ki)
pH
7±n/a
Temperature
298.15±n/a K
Ki
0.2±0.02 nM
IC50
80±10 nM
Citation
 Yuvaniyama, JChitnumsub, PKamchonwongpaisan, SVanichtanankul, JSirawaraporn, WTaylor, PWalkinshaw, MDYuthavong, Y Insights into antifolate resistance from malarial DHFR-TS structures. Nat Struct Biol 10:257-65 (2003)  
Target
Name:
Bifunctional dihydrofolate reductase-thymidylate synthase
Synonyms:
Bifunctional dihydrofolate reductase-thymidylate synthase (DHFR-TS) PfDHFR-TS
Type:
Enzyme
Mol. Mass.:
71741.43
Organism:
Plasmodium falciparum (isolate K1 / Thailand)
Description:
PfDHFR-TS wild-type (TM4/8.2) was expressed and purified from E. coli.
Residue:
608
  
Inhibitor
Name:
BDBM18512
Synonyms:
5-(4-chlorophenyl)-6-ethylpyrimidine-2,4-diamine Pyrimethamine (Pyr) cid_4993
Type:
Small organic molecule
Emp. Form.:
C12H13ClN4
Mol. Mass.:
248.711
SMILES:
CCc1nc(N)nc(N)c1-c1ccc(Cl)cc1
:
Substrate
Name:
BDBM18044
Synonyms:
(2S)-2-[(4-{[(2-amino-4-oxo-1,4,7,8-tetrahydropteridin-6-yl)methyl]amino}phenyl)formamido]pentanedioic acid dihydrofolic acid
Type:
Small organic molecule
Emp. Form.:
C19H21N7O6
Mol. Mass.:
443.4133
SMILES:
Nc1nc2NCC(CNc3ccc(cc3)C(=O)N[C@@H](CCC(O)=O)C(O)=O)=Nc2c(=O)[nH]1
: