Target
Thymidylate synthase
Ligand
BDBM18795
Substrate
BDBM18754
Meas. Tech.
Dihydrofolate Reductase (DHFR) Assay
IC50
5700±n/a nM
Citation
 Gangjee, ALin, XKisliuk, RLMcGuire, JJ Synthesis of N-{4-[(2,4-diamino-5-methyl-4,7-dihydro-3H-pyrrolo[2,3-d]pyrimidin-6-yl)thio]benzoyl}-L-glutamic acid and N-{4-[(2-amino-4-oxo-5-methyl-4,7-dihydro-3H-pyrrolo[2,3-d]pyrimidin-6-yl)thio]benzoyl}-L-glutamic acid as dual inhibitors of dihydrofolate reductase and thymidylate synthase and a J Med Chem 48:7215-22 (2005)  
Target
Name:
Thymidylate synthase
Synonyms:
TS TYSY_ECOLI thyA
Type:
Enzyme
Mol. Mass.:
30475.81
Organism:
Escherichia coli
Description:
Residue:
264
  
Inhibitor
Name:
BDBM18795
Synonyms:
(2S)-2-[(5-{methyl[(2-methyl-4-oxo-1,4-dihydroquinazolin-6-yl)methyl]amino}thiophen-2-yl)formamido]pentanedioic acid RTX Tomudex | ZD1694
Type:
Small organic molecule
Emp. Form.:
C21H22N4O6S
Mol. Mass.:
458.488
SMILES:
CN(Cc1ccc2nc(C)[nH]c(=O)c2c1)c1ccc(s1)C(=O)N[C@@H](CCC(O)=O)C(O)=O
:
Substrate
Name:
BDBM18754
Synonyms:
(2S)-2-[(4-{11-amino-13-oxo-2,4,8,10,12-pentaazatricyclo[7.4.0.0^{2,6}]trideca-1(9),11-dien-4-yl}phenyl)formamido]pentanedioate 5,10-Methylenetetrahydrofolate
Type:
Small organic molecule
Emp. Form.:
C20H21N7O6
Mol. Mass.:
455.4251
SMILES:
Nc1nc2NCC3CN(CN3c2c(=O)[nH]1)c1ccc(cc1)C(=O)N[C@@H](CCC([O-])=O)C([O-])=O
: