Target
Peregrin
Ligand
BDBM50157570
Substrate
Meas. Tech.
Alpha Screen competitive assay
pH
7.4±n/a
Temperature
298.15±n/a K
IC50
114±61 nM
Comments
extracted
Citation
 Meier, JCTallant, CFedorov, OWitwicka, HHwang, SYvan Stiphout, RGLambert, JPRogers, CYapp, CGerstenberger, BSFedele, VSavitsky, PHeidenreich, DDaniels, DLOwen, DRFish, PVIgoe, NMBayle, EDHaendler, BOppermann, UCTBuffa, FBrennan, PEMüller, SGingras, ACOdgren, PRBirnbaum, MJKnapp, S Selective Targeting of Bromodomains of the Bromodomain-PHD Fingers Family Impairs Osteoclast Differentiation. ACS Chem Biol 12:2619-2630 (2017)  
Target
Name:
Peregrin
Synonyms:
BR140 BRPF1_HUMAN Peregrin | Protein Br140
Type:
PROTEIN
Mol. Mass.:
137524.47
Organism:
Homo sapiens (Human)
Description:
ChEMBL_108054
Residue:
1214
  
Inhibitor
Name:
BDBM50157570
Synonyms:
4-cyano-N-(1,3-dimethyl-2-oxoquinolin-6-yl)-2-methoxybenzenesulfonamide D0O6XT NI 57 US11773085, Compound B26
Type:
Small organic molecule
Emp. Form.:
C19H17N3O4S
Mol. Mass.:
383.421
SMILES:
COc1cc(ccc1S(=O)(=O)Nc1ccc2n(C)c(=O)c(C)cc2c1)C#N
: