Target
Androgen receptor
Ligand
BDBM18675
Substrate
BDBM26258
Meas. Tech.
Competitive Radioligand Displacement Assay
pH
7.4±n/a
Temperature
277.15±n/a K
Ki
4.6±0.3 nM
Comments
IC50=17400 +/- 4900 for inhibiting growth of prostate cancer cell line, LNCaP.
Citation
 Hwang, DJYang, JXu, HRakov, IMMohler, MLDalton, JTMiller, DD Arylisothiocyanato selective androgen receptor modulators (SARMs) for prostate cancer. Bioorg Med Chem 14:6525-38 (2006)  
Target
Name:
Androgen receptor
Synonyms:
ANDR_RAT Ar Nr3c4 | androgen
Type:
Enzyme
Mol. Mass.:
98219.08
Organism:
Rattus norvegicus (Rat)
Description:
P15207
Residue:
902
  
Inhibitor
Name:
BDBM18675
Synonyms:
(2S)-2-hydroxy-3-(4-isothiocyanatophenoxy)-2-methyl-N-[4-nitro-3-(trifluoromethyl)phenyl]propanamide Nonsteroidal AR Ligand, S-16
Type:
Small organic molecule
Emp. Form.:
C18H14F3N3O5S
Mol. Mass.:
441.381
SMILES:
CC(O)(COc1ccc([N-]C#[S+])cc1)C(=O)Nc1ccc(c(c1)C(F)(F)F)[N+]([O-])=O
:
Substrate
Name:
BDBM26258
Synonyms:
(1S,2R,9R,10R,11S,14S,15S)-14-hydroxy-9,14,15-trimethyltetracyclo[8.7.0.0^{2,7}.0^{11,15}]heptadec-6-en-5-one [3H]Mibolerone
Type:
radiolabeled ligand
Emp. Form.:
C20H30O2
Mol. Mass.:
302.451
SMILES:
[H][C@@]12CC[C@](C)(O)[C@@]1(C)CC[C@]1([H])[C@@]3([H])CCC(=O)C=C3C[C@@H](C)[C@@]21[H]
: