Target
Androgen receptor
Ligand
BDBM19248
Substrate
BDBM26258
Meas. Tech.
Competitive Radioligand Displacement Assay
pH
7.4±n/a
Temperature
277.15±n/a K
Ki
21.4±7.0 nM
Comments
IC50=21500 +/- 700 for inhibiting growth of prostate cancer cell line, LNCaP.
Citation
 Hwang, DJYang, JXu, HRakov, IMMohler, MLDalton, JTMiller, DD Arylisothiocyanato selective androgen receptor modulators (SARMs) for prostate cancer. Bioorg Med Chem 14:6525-38 (2006)  
Target
Name:
Androgen receptor
Synonyms:
ANDR_RAT Ar Nr3c4 | androgen
Type:
Enzyme
Mol. Mass.:
98219.08
Organism:
Rattus norvegicus (Rat)
Description:
P15207
Residue:
902
  
Inhibitor
Name:
BDBM19248
Synonyms:
(2S)-2-hydroxy-3-[(4-isothiocyanatophenyl)amino]-2-methyl-N-[4-nitro-3-(trifluoromethyl)phenyl]propanamide | arylisothiocyanato derivative, S-32
Type:
Small organic molecule
Emp. Form.:
C18H15F3N4O4S
Mol. Mass.:
440.396
SMILES:
C[C@](O)(CNc1ccc(cc1)N=C=S)C(=O)Nc1ccc(c(c1)C(F)(F)F)[N+]([O-])=O
:
Substrate
Name:
BDBM26258
Synonyms:
(1S,2R,9R,10R,11S,14S,15S)-14-hydroxy-9,14,15-trimethyltetracyclo[8.7.0.0^{2,7}.0^{11,15}]heptadec-6-en-5-one [3H]Mibolerone
Type:
radiolabeled ligand
Emp. Form.:
C20H30O2
Mol. Mass.:
302.451
SMILES:
[H][C@@]12CC[C@](C)(O)[C@@]1(C)CC[C@]1([H])[C@@]3([H])CCC(=O)C=C3C[C@@H](C)[C@@]21[H]
: