Target
Inosine-5'-monophosphate dehydrogenase 1
Ligand
BDBM19264
Substrate
BDBM19254
Meas. Tech.
IMPDH Type 1 Enzyme Assay
pH
8±n/a
Temperature
298.15±n/a K
Ki
33±n/a nM
Comments
K562 cell proliferation, IC50=7.7 uM.
Citation
 Chen, LGao, GFelczak, KBonnac, LPatterson, SEWilson, DBennett, EMJayaram, HNHedstrom, LPankiewicz, KW Probing Binding Requirements of Type I and Type II Isoforms of Inosine Monophosphate Dehydrogenase with Adenine-Modified Nicotinamide Adenine Dinucleotide Analogues. J Med Chem 50:5743-5751 (2007)  
Target
Name:
Inosine-5'-monophosphate dehydrogenase 1
Synonyms:
IMDH1_HUMAN IMPD 1 IMPDH-I Inosine Monophosphate Dehydrogenase Type 1 (IMPDH1) | Inosine-5'-monophosphate dehydrogenase (IMPDH)
Type:
Enzyme
Mol. Mass.:
55407.70
Organism:
Homo sapiens (Human)
Description:
Recombinant IMPDH1 expressed in E. coli.
Residue:
514
  
Inhibitor
Name:
BDBM19264
Synonyms:
(4E)-6-(4-hydroxy-6-methoxy-7-methyl-3-oxo-1,3-dihydro-2-benzofuran-5-yl)-4-methylhex-4-enoic acid CHEMBL866 Mycophenolic Acid (MPA) | Myfortic
Type:
Small organic molecule
Emp. Form.:
C17H20O6
Mol. Mass.:
320.3371
SMILES:
COc1c(C)c2COC(=O)c2c(O)c1C\C=C(/C)CCC(O)=O
:
Substrate
Name:
BDBM19254
Synonyms:
IMP Inosinic acid [(2R,3S,4R,5R)-3,4-dihydroxy-5-(6-oxo-3H-purin-9-yl)oxolan-2-yl]methyl dihydrogen {[(2R,3S,4R,5R)-3,4-dihydroxy-5-(6-oxo-6,9-dihydro-3H-purin-9-yl)oxolan-2-yl]methoxy}phosphonic acid
Type:
Nucleoside or nucleotide
Emp. Form.:
C10H13N4O8P
Mol. Mass.:
348.206
SMILES:
O[C@@H]1[C@@H](COP(O)(O)=O)O[C@H]([C@@H]1O)n1cnc2c1nc[nH]c2=O
: