Target
Transient receptor potential cation channel subfamily A member 1
Ligand
BDBM361859
Substrate
Meas. Tech.
Measuring Inhibition of the TRPA1 Ion Channel
IC50
56.0±n/a nM
Citation
 Chenard, BLWu, X Inhibiting the transient receptor potential A1 ion channel US Patent  US10221177 Publication Date 3/5/2019 
Target
Name:
Transient receptor potential cation channel subfamily A member 1
Synonyms:
ANKTM1 TRPA1 Transformation-sensitive protein p120 | Transient receptor potential cation channel subfamily A member 1 (TRPA1)
Type:
Protein
Mol. Mass.:
127514.20
Organism:
Homo sapiens (Human)
Description:
O75762
Residue:
1119
  
Inhibitor
Name:
BDBM361859
Synonyms:
US10221177, Compound 232
Type:
Small organic molecule
Emp. Form.:
C22H19F3N8O4
Mol. Mass.:
516.4327
SMILES:
CC(=O)Cn1c(=O)n(C)c2ncn(CC(=O)Nc3cncc(n3)-c3cnc(c(C)c3)C(F)(F)F)c2c1=O
: