Target
Mitogen-activated protein kinase 1
Ligand
BDBM243983
Substrate
Meas. Tech.
Activated ERK2 Kinase Assay
pH
7.5±n/a
IC50
839±n/a nM
Comments
extracted
Citation
 Dillon, MPLindvall, MPoon, DRamurthy, SRauniyar, VShafer, CSubramanian, STanner, HR Substituted pyrrolo[3,4-d]pyrimidines as kinase inhibitors US Patent  US9546173 Publication Date 1/17/2017 
Target
Name:
Mitogen-activated protein kinase 1
Synonyms:
ERK2 Extracellular signal-regulated kinase 2 Extracellular signal-regulated kinase 2 (ERK2) MAPK 2 MK01_HUMAN Mitogen-activated protein kinase 1 (ERK-2) Mitogen-activated protein kinase 2 PRKM2 | p42-MAPK
Type:
Ser/Thr Protein Kinase
Mol. Mass.:
41392.76
Organism:
Homo sapiens (Human)
Description:
P28482
Residue:
360
  
Inhibitor
Name:
BDBM243983
Synonyms:
US9546173, cmpd 59 | n-((s)-2-hydroxy-1-phenylethyl)-2-(((1r,3s)-3-hydroxycyclobutyl)amino)-5,5-dimethyl-5h-pyrrolo[3,4-d]pyrimidine-6(7h)-carboxamide
Type:
Small organic molecule
Emp. Form.:
C21H27N5O3
Mol. Mass.:
397.4708
SMILES:
CC1(C)N(Cc2nc(N[C@H]3C[C@H](O)C3)ncc12)C(=O)N[C@H](CO)c1ccccc1
: