Target
Mitogen-activated protein kinase 1
Ligand
BDBM244004
Substrate
Meas. Tech.
Activated ERK2 Kinase Assay
pH
7.5±n/a
IC50
13.0±n/a nM
Comments
extracted
Citation
 Dillon, MPLindvall, MPoon, DRamurthy, SRauniyar, VShafer, CSubramanian, STanner, HR Substituted pyrrolo[3,4-d]pyrimidines as kinase inhibitors US Patent  US9546173 Publication Date 1/17/2017 
Target
Name:
Mitogen-activated protein kinase 1
Synonyms:
ERK2 Extracellular signal-regulated kinase 2 Extracellular signal-regulated kinase 2 (ERK2) MAPK 2 MK01_HUMAN Mitogen-activated protein kinase 1 (ERK-2) Mitogen-activated protein kinase 2 PRKM2 | p42-MAPK
Type:
Ser/Thr Protein Kinase
Mol. Mass.:
41392.76
Organism:
Homo sapiens (Human)
Description:
P28482
Residue:
360
  
Inhibitor
Name:
BDBM244004
Synonyms:
(s)-n-(2-hydroxy-1-phenylethyl)-2'-((tetrahydro-2h-pyran-4-yl)amino)spiro[cyclobutane-1,5'-pyrrolo[3,4-d]pyrimidine]-6'(7'h)-carboxamide | US9546173, cmpd 77
Type:
Small organic molecule
Emp. Form.:
C23H29N5O3
Mol. Mass.:
423.5081
SMILES:
OC[C@@H](NC(=O)N1Cc2nc(NC3CCOCC3)ncc2C11CCC1)c1ccccc1
: