Target
Mitogen-activated protein kinase 1
Ligand
BDBM244211
Substrate
Meas. Tech.
Activated ERK2 Kinase Assay
pH
7.5±n/a
IC50
125000±n/a nM
Comments
extracted
Citation
 Dillon, MPLindvall, MPoon, DRamurthy, SRauniyar, VShafer, CSubramanian, STanner, HR Substituted pyrrolo[3,4-d]pyrimidines as kinase inhibitors US Patent  US9546173 Publication Date 1/17/2017 
Target
Name:
Mitogen-activated protein kinase 1
Synonyms:
ERK2 Extracellular signal-regulated kinase 2 Extracellular signal-regulated kinase 2 (ERK2) MAPK 2 MK01_HUMAN Mitogen-activated protein kinase 1 (ERK-2) Mitogen-activated protein kinase 2 PRKM2 | p42-MAPK
Type:
Ser/Thr Protein Kinase
Mol. Mass.:
41392.76
Organism:
Homo sapiens (Human)
Description:
P28482
Residue:
360
  
Inhibitor
Name:
BDBM244211
Synonyms:
(r)-n-(1-(dimethylamino)propan-2-yl)-5,5-dimethyl-2-(phenylamino)-5h-pyrrolo[3,4-d]pyrimidine-6(7h)-carboxamide US9546173, cmpd 152 | US9546173, cmpd 167
Type:
Small organic molecule
Emp. Form.:
C20H28N6O
Mol. Mass.:
368.4759
SMILES:
CC(CN(C)C)NC(=O)N1Cc2nc(Nc3ccccc3)ncc2C1(C)C
: