Target
Ribosomal protein S6 kinase alpha-3
Ligand
BDBM244243
Substrate
IC50
13960±n/a nM
Citation
 Dillon, MPLindvall, MPoon, DRamurthy, SRauniyar, VShafer, CSubramanian, STanner, HR Substituted pyrrolo[3,4-d]pyrimidines as kinase inhibitors US Patent  US9546173 Publication Date 1/17/2017 
Target
Name:
Ribosomal protein S6 kinase alpha-3
Synonyms:
90 kDa ribosomal protein S6 kinase 3 ISPK1 MAP kinase-activated protein kinase 1b RPS6KA3 RSK2 Ribosomal protein S6 kinase Ribosomal protein S6 kinase alpha-3 (RSK2) S6K-alpha 3 p90 ribosomal s6 kinase (RSK2) p90RSK | pp90RSK2
Type:
Serine/threonine-protein kinase
Mol. Mass.:
83740.03
Organism:
Homo sapiens (Human)
Description:
The human RSK2 sequence differed from the Genbank entry NM_004586 at one residue, V45G. The protein was cloned and purified from baculovirus expression system.
Residue:
740
  
Inhibitor
Name:
BDBM244243
Synonyms:
5,5-dimethyl-n-(1-methylpiperidin-4-yl)-2-(phenylamino)-5h-pyrrolo[3,4-d]pyrimidine-6(7h)-carboxamide | US9546173, cmpd 163
Type:
Small organic molecule
Emp. Form.:
C21H28N6O
Mol. Mass.:
380.4866
SMILES:
CN1CCC(CC1)NC(=O)N1Cc2nc(Nc3ccccc3)ncc2C1(C)C
: