Target
Cathepsin S
Ligand
BDBM19514
Substrate
BDBM19490
Meas. Tech.
Enzyme Inhibition Assay
pH
6.5±n/a
Temperature
295.15±n/a K
IC50
0.2±n/a nM
Citation
 Gauthier, JYBlack, WCCourchesne, ICromlish, WDesmarais, SHoule, RLamontagne, SLi, CSMassé, FMcKay, DJOuellet, MRobichaud, JTruchon, JFTruong, VLWang, QPercival, MD The identification of potent, selective, and bioavailable cathepsin S inhibitors. Bioorg Med Chem Lett 17:4929-33 (2007)  
Target
Name:
Cathepsin S
Synonyms:
CATS_HUMAN Cathepsin S (Cat S) | cathepsin S preproprotein
Type:
Protein
Mol. Mass.:
37507.38
Organism:
Homo sapiens (Human)
Description:
P25774
Residue:
331
  
Inhibitor
Name:
BDBM19514
Synonyms:
(2R)-N-(1-cyanocyclopropyl)-3-[(3,4-dichlorobenzene)sulfonyl]-2-{[(1S)-2,2,2-trifluoro-1-phenylethyl]amino}propanamide | trifluoroethylamine inhibitor, 24
Type:
Small organic molecule
Emp. Form.:
C21H18Cl2F3N3O3S
Mol. Mass.:
520.352
SMILES:
FC(F)(F)[C@@H](N[C@@H](CS(=O)(=O)c1ccc(Cl)c(Cl)c1)C(=O)NC1(CC1)C#N)c1ccccc1
:
Substrate
Name:
BDBM19490
Synonyms:
Cbz-Val-Val-Arg-AMC Z-Val-Val-Arg-AMC
Type:
Emp. Form.:
Mol. Mass.:
SMILES:
: