Target
Cathepsin S
Ligand
BDBM19565
Substrate
BDBM19546
Meas. Tech.
Enzyme Inhibition Assay
pH
5.5±n/a
Temperature
310.15±n/a K
Ki
29±n/a nM
Citation
 Liu, HTully, DCEpple, RBursulaya, BLi, JHarris, JLWilliams, JARusso, RTumanut, CRoberts, MJAlper, PBHe, YKaranewsky, DS Design and synthesis of arylaminoethyl amides as noncovalent inhibitors of cathepsin S. Part 1. Bioorg Med Chem Lett 15:4979-84 (2005)  
Target
Name:
Cathepsin S
Synonyms:
CATS_HUMAN Cathepsin S (Cat S) | cathepsin S preproprotein
Type:
Protein
Mol. Mass.:
37507.38
Organism:
Homo sapiens (Human)
Description:
P25774
Residue:
331
  
Inhibitor
Name:
BDBM19565
Synonyms:
(2S)-3-(1H-indol-2-yl)-N-{2-[(4-methoxyphenyl)amino]ethyl}-2-[(3-methylphenyl)formamido]propanamide | arylaminoethyl amide, 5s
Type:
Small organic molecule
Emp. Form.:
C28H30N4O3
Mol. Mass.:
470.5628
SMILES:
COc1ccc(NCCNC(=O)[C@H](Cc2cc3ccccc3[nH]2)NC(=O)c2cccc(C)c2)cc1
:
Substrate
Name:
BDBM19546
Synonyms:
7-amino-3-carbamoylmethyl-4-methyl coumarin labeled fluorescent peptide | Ac-His-Pro-Val-Lys-ACMC
Type:
Emp. Form.:
Mol. Mass.:
SMILES:
: