Target
Cathepsin S
Ligand
BDBM19566
Substrate
BDBM19546
Meas. Tech.
Enzyme Inhibition Assay
pH
5.5±n/a
Temperature
310.15±n/a K
Ki
34±n/a nM
Citation
 Liu, HTully, DCEpple, RBursulaya, BLi, JHarris, JLWilliams, JARusso, RTumanut, CRoberts, MJAlper, PBHe, YKaranewsky, DS Design and synthesis of arylaminoethyl amides as noncovalent inhibitors of cathepsin S. Part 1. Bioorg Med Chem Lett 15:4979-84 (2005)  
Target
Name:
Cathepsin S
Synonyms:
CATS_HUMAN Cathepsin S (Cat S) | cathepsin S preproprotein
Type:
Protein
Mol. Mass.:
37507.38
Organism:
Homo sapiens (Human)
Description:
P25774
Residue:
331
  
Inhibitor
Name:
BDBM19566
Synonyms:
(2S)-N-{2-[(4-methoxyphenyl)amino]ethyl}-2-[(3-methylphenyl)formamido]-3-(4-phenylphenyl)propanamide | arylaminoethyl amide, 5t
Type:
Small organic molecule
Emp. Form.:
C32H33N3O3
Mol. Mass.:
507.6227
SMILES:
COc1ccc(NCCNC(=O)[C@H](Cc2ccc(cc2)-c2ccccc2)NC(=O)c2cccc(C)c2)cc1
:
Substrate
Name:
BDBM19546
Synonyms:
7-amino-3-carbamoylmethyl-4-methyl coumarin labeled fluorescent peptide | Ac-His-Pro-Val-Lys-ACMC
Type:
Emp. Form.:
Mol. Mass.:
SMILES:
: