Target
Procathepsin L
Ligand
BDBM19552
Substrate
BDBM19584
Meas. Tech.
Enzyme Inhibition Assay
Ki
3.7±n/a nM
Citation
 Liu, HTully, DCEpple, RBursulaya, BLi, JHarris, JLWilliams, JARusso, RTumanut, CRoberts, MJAlper, PBHe, YKaranewsky, DS Design and synthesis of arylaminoethyl amides as noncovalent inhibitors of cathepsin S. Part 1. Bioorg Med Chem Lett 15:4979-84 (2005)  
Target
Name:
Procathepsin L
Synonyms:
CATL1_HUMAN CTSL CTSL1 Cathepsin L Cathepsin L1 heavy chain MEP cathepsin L preproprotein
Type:
Enzyme
Mol. Mass.:
37557.19
Organism:
Homo sapiens (Human)
Description:
Purchased from Calbiochem (San Diego, CA).
Residue:
333
  
Inhibitor
Name:
BDBM19552
Synonyms:
(2S)-N-{2-[(4-methoxyphenyl)amino]ethyl}-2-[(3-methylphenyl)formamido]-3-phenylpropanamide | arylaminoethyl amide, 5f
Type:
Small organic molecule
Emp. Form.:
C26H29N3O3
Mol. Mass.:
431.5268
SMILES:
COc1ccc(NCCNC(=O)[C@H](Cc2ccccc2)NC(=O)c2cccc(C)c2)cc1
:
Substrate
Name:
BDBM19584
Synonyms:
7-amino-3-carbamoylmethyl-4-methyl coumarin labeled fluorescent peptide | Ac-His-Lys-Phe-Lys-ACMC
Type:
Emp. Form.:
Mol. Mass.:
SMILES:
: