Target
Cathepsin S
Ligand
BDBM19603
Substrate
BDBM19546
Meas. Tech.
Enzyme Inhibition Assay
pH
5.5±n/a
Temperature
310.15±n/a K
Ki
8±n/a nM
Citation
 Alper, PBLiu, HChatterjee, AKNguyen, KTTully, DCTumanut, CLi, JHarris, JLTuntland, TChang, JGordon, PHollenbeck, TKaranewsky, DS Arylaminoethyl amides as noncovalent inhibitors of cathepsin S. Part 2: Optimization of P1 and N-aryl. Bioorg Med Chem Lett 16:1486-90 (2006)  
Target
Name:
Cathepsin S
Synonyms:
CATS_HUMAN Cathepsin S (Cat S) | cathepsin S preproprotein
Type:
Protein
Mol. Mass.:
37507.38
Organism:
Homo sapiens (Human)
Description:
P25774
Residue:
331
  
Inhibitor
Name:
BDBM19603
Synonyms:
(2S)-4-cyclohexyl-N-[(2R,3R)-1-(5-fluoro-2,3-dihydro-1H-indol-1-yl)-3-hydroxybutan-2-yl]-2-[(3-methoxyphenyl)formamido]butanamide | arylaminoethyl amide, 8k
Type:
Small organic molecule
Emp. Form.:
C30H40FN3O4
Mol. Mass.:
525.6547
SMILES:
COc1cccc(c1)C(=O)N[C@@H](CCC1CCCCC1)C(=O)N[C@H](CN1CCc2cc(F)ccc12)[C@@H](C)O
:
Substrate
Name:
BDBM19546
Synonyms:
7-amino-3-carbamoylmethyl-4-methyl coumarin labeled fluorescent peptide | Ac-His-Pro-Val-Lys-ACMC
Type:
Emp. Form.:
Mol. Mass.:
SMILES:
: