Target
Procathepsin L
Ligand
BDBM19586
Substrate
BDBM19584
Meas. Tech.
Enzyme Inhibition Assay
Ki
14±n/a nM
Citation
 Alper, PBLiu, HChatterjee, AKNguyen, KTTully, DCTumanut, CLi, JHarris, JLTuntland, TChang, JGordon, PHollenbeck, TKaranewsky, DS Arylaminoethyl amides as noncovalent inhibitors of cathepsin S. Part 2: Optimization of P1 and N-aryl. Bioorg Med Chem Lett 16:1486-90 (2006)  
Target
Name:
Procathepsin L
Synonyms:
CATL1_HUMAN CTSL CTSL1 Cathepsin L Cathepsin L1 heavy chain MEP cathepsin L preproprotein
Type:
Enzyme
Mol. Mass.:
37557.19
Organism:
Homo sapiens (Human)
Description:
Purchased from Calbiochem (San Diego, CA).
Residue:
333
  
Inhibitor
Name:
BDBM19586
Synonyms:
(2S)-N-{2-[(4-methoxy-2,6-dimethylphenyl)amino]ethyl}-4-methyl-2-[(3-methylphenyl)formamido]pentanamide | arylaminoethyl amide, 3b
Type:
Small organic molecule
Emp. Form.:
C25H35N3O3
Mol. Mass.:
425.5637
SMILES:
COc1cc(C)c(NCCNC(=O)[C@H](CC(C)C)NC(=O)c2cccc(C)c2)c(C)c1
:
Substrate
Name:
BDBM19584
Synonyms:
7-amino-3-carbamoylmethyl-4-methyl coumarin labeled fluorescent peptide | Ac-His-Lys-Phe-Lys-ACMC
Type:
Emp. Form.:
Mol. Mass.:
SMILES:
: