Target
Cathepsin S
Ligand
BDBM19683
Substrate
BDBM19546
Meas. Tech.
Enzyme Inhibition Assay
pH
5.5±n/a
Temperature
310.15±n/a K
Ki
18±n/a nM
Citation
 Tully, DCLiu, HChatterjee, AKAlper, PBWilliams, JARoberts, MJMutnick, DWoodmansee, DHHollenbeck, TGordon, PChang, JTuntland, TTumanut, CLi, JHarris, JLKaranewsky, DS Arylaminoethyl carbamates as a novel series of potent and selective cathepsin S inhibitors. Bioorg Med Chem Lett 16:5107-11 (2006)  
Target
Name:
Cathepsin S
Synonyms:
CATS_HUMAN Cathepsin S (Cat S) | cathepsin S preproprotein
Type:
Protein
Mol. Mass.:
37507.38
Organism:
Homo sapiens (Human)
Description:
P25774
Residue:
331
  
Inhibitor
Name:
BDBM19683
Synonyms:
(2S)-3-cyclohexyl-1-(morpholin-4-yl)-1-oxopropan-2-yl N-[(2S)-4-phenyl-1-{[4-(trifluoromethoxy)phenyl]amino}butan-2-yl]carbamate | Arylaminoethyl carbamate, 14
Type:
Small organic molecule
Emp. Form.:
C31H40F3N3O5
Mol. Mass.:
591.6616
SMILES:
FC(F)(F)Oc1ccc(NC[C@H](CCc2ccccc2)NC(=O)O[C@@H](CC2CCCCC2)C(=O)N2CCOCC2)cc1
:
Substrate
Name:
BDBM19546
Synonyms:
7-amino-3-carbamoylmethyl-4-methyl coumarin labeled fluorescent peptide | Ac-His-Pro-Val-Lys-ACMC
Type:
Emp. Form.:
Mol. Mass.:
SMILES:
: