Target
Cathepsin S
Ligand
BDBM19686
Substrate
BDBM19546
Meas. Tech.
Enzyme Inhibition Assay
pH
5.5±n/a
Temperature
310.15±n/a K
Ki
80±n/a nM
Citation
 Tully, DCLiu, HChatterjee, AKAlper, PBWilliams, JARoberts, MJMutnick, DWoodmansee, DHHollenbeck, TGordon, PChang, JTuntland, TTumanut, CLi, JHarris, JLKaranewsky, DS Arylaminoethyl carbamates as a novel series of potent and selective cathepsin S inhibitors. Bioorg Med Chem Lett 16:5107-11 (2006)  
Target
Name:
Cathepsin S
Synonyms:
CATS_HUMAN Cathepsin S (Cat S) | cathepsin S preproprotein
Type:
Protein
Mol. Mass.:
37507.38
Organism:
Homo sapiens (Human)
Description:
P25774
Residue:
331
  
Inhibitor
Name:
BDBM19686
Synonyms:
(2S)-3-cyclohexyl-1-(morpholin-4-yl)-1-oxopropan-2-yl N-[(2S)-1-(5-fluoro-2,2-dimethyl-2,3-dihydro-1H-indol-1-yl)propan-2-yl]carbamate | Arylaminoethyl carbamate, 17
Type:
Small organic molecule
Emp. Form.:
C27H40FN3O4
Mol. Mass.:
489.6226
SMILES:
C[C@@H](CN1c2ccc(F)cc2CC1(C)C)NC(=O)O[C@@H](CC1CCCCC1)C(=O)N1CCOCC1
:
Substrate
Name:
BDBM19546
Synonyms:
7-amino-3-carbamoylmethyl-4-methyl coumarin labeled fluorescent peptide | Ac-His-Pro-Val-Lys-ACMC
Type:
Emp. Form.:
Mol. Mass.:
SMILES:
: