Target
Procathepsin L
Ligand
BDBM19685
Substrate
BDBM19584
Meas. Tech.
Enzyme Inhibition Assay
Ki
>100000±n/a nM
Citation
 Tully, DCLiu, HChatterjee, AKAlper, PBWilliams, JARoberts, MJMutnick, DWoodmansee, DHHollenbeck, TGordon, PChang, JTuntland, TTumanut, CLi, JHarris, JLKaranewsky, DS Arylaminoethyl carbamates as a novel series of potent and selective cathepsin S inhibitors. Bioorg Med Chem Lett 16:5107-11 (2006)  
Target
Name:
Procathepsin L
Synonyms:
CATL1_HUMAN CTSL CTSL1 Cathepsin L Cathepsin L1 heavy chain MEP cathepsin L preproprotein
Type:
Enzyme
Mol. Mass.:
37557.19
Organism:
Homo sapiens (Human)
Description:
Purchased from Calbiochem (San Diego, CA).
Residue:
333
  
Inhibitor
Name:
BDBM19685
Synonyms:
(2S)-4,4-dimethyl-1-(morpholin-4-yl)-1-oxopentan-2-yl N-[(2S)-1-{[4-(trifluoromethoxy)phenyl]amino}propan-2-yl]carbamate | Arylaminoethyl carbamate, 16
Type:
Small organic molecule
Emp. Form.:
C22H32F3N3O5
Mol. Mass.:
475.5018
SMILES:
C[C@@H](CNc1ccc(OC(F)(F)F)cc1)NC(=O)O[C@@H](CC(C)(C)C)C(=O)N1CCOCC1
:
Substrate
Name:
BDBM19584
Synonyms:
7-amino-3-carbamoylmethyl-4-methyl coumarin labeled fluorescent peptide | Ac-His-Lys-Phe-Lys-ACMC
Type:
Emp. Form.:
Mol. Mass.:
SMILES:
: