Target
Cathepsin S
Ligand
BDBM19702
Substrate
BDBM19546
Meas. Tech.
Enzyme Inhibition Assay
pH
5.5±n/a
Temperature
310.15±n/a K
Ki
17±n/a nM
Citation
 Tully, DCLiu, HChatterjee, AKAlper, PBEpple, RWilliams, JARoberts, MJWoodmansee, DHMasick, BTTumanut, CLi, JSpraggon, GHornsby, MChang, JTuntland, THollenbeck, TGordon, PHarris, JLKaranewsky, DS Synthesis and SAR of arylaminoethyl amides as noncovalent inhibitors of cathepsin S: P3 cyclic ethers. Bioorg Med Chem Lett 16:5112-7 (2006)  
Target
Name:
Cathepsin S
Synonyms:
CATS_HUMAN Cathepsin S (Cat S) | cathepsin S preproprotein
Type:
Protein
Mol. Mass.:
37507.38
Organism:
Homo sapiens (Human)
Description:
P25774
Residue:
331
  
Inhibitor
Name:
BDBM19702
Synonyms:
(2S)-2-(1-benzofuran-2-ylformamido)-3-cyclohexyl-N-(2-{[4-(trifluoromethoxy)phenyl]amino}ethyl)propanamide | arylaminoethyl amide deriv. 16
Type:
Small organic molecule
Emp. Form.:
C27H30F3N3O4
Mol. Mass.:
517.54
SMILES:
FC(F)(F)Oc1ccc(NCCNC(=O)[C@H](CC2CCCCC2)NC(=O)c2cc3ccccc3o2)cc1
:
Substrate
Name:
BDBM19546
Synonyms:
7-amino-3-carbamoylmethyl-4-methyl coumarin labeled fluorescent peptide | Ac-His-Pro-Val-Lys-ACMC
Type:
Emp. Form.:
Mol. Mass.:
SMILES:
: