Target
Procathepsin L
Ligand
BDBM19715
Substrate
BDBM19584
Meas. Tech.
Enzyme Inhibition Assay
Ki
6±n/a nM
Citation
 Tully, DCLiu, HChatterjee, AKAlper, PBEpple, RWilliams, JARoberts, MJWoodmansee, DHMasick, BTTumanut, CLi, JSpraggon, GHornsby, MChang, JTuntland, THollenbeck, TGordon, PHarris, JLKaranewsky, DS Synthesis and SAR of arylaminoethyl amides as noncovalent inhibitors of cathepsin S: P3 cyclic ethers. Bioorg Med Chem Lett 16:5112-7 (2006)  
Target
Name:
Procathepsin L
Synonyms:
CATL1_HUMAN CTSL CTSL1 Cathepsin L Cathepsin L1 heavy chain MEP cathepsin L preproprotein
Type:
Enzyme
Mol. Mass.:
37557.19
Organism:
Homo sapiens (Human)
Description:
Purchased from Calbiochem (San Diego, CA).
Residue:
333
  
Inhibitor
Name:
BDBM19715
Synonyms:
(2S)-3-cyclohexyl-2-(morpholin-4-ylcarbonylamino)-N-[(2S)-1-{[4-(trifluoromethoxy)phenyl]amino}butan-2-yl]propanamide | arylaminoethyl amide deriv. 29
Type:
Small organic molecule
Emp. Form.:
C25H37F3N4O4
Mol. Mass.:
514.5809
SMILES:
CC[C@@H](CNc1ccc(OC(F)(F)F)cc1)NC(=O)[C@H](CC1CCCCC1)NC(=O)N1CCOCC1
:
Substrate
Name:
BDBM19584
Synonyms:
7-amino-3-carbamoylmethyl-4-methyl coumarin labeled fluorescent peptide | Ac-His-Lys-Phe-Lys-ACMC
Type:
Emp. Form.:
Mol. Mass.:
SMILES:
: