Target
Cathepsin K
Ligand
BDBM19757
Substrate
BDBM19485
Meas. Tech.
Enzyme Inhibition Assay
pH
7±n/a
Temperature
295.15±n/a K
IC50
43±n/a nM
Citation
 Altmann, EAichholz, RBetschart, CBuhl, TGreen, JLattmann, RMissbach, M Dipeptide nitrile inhibitors of cathepsin K. Bioorg Med Chem Lett 16:2549-54 (2006)  
Target
Name:
Cathepsin K
Synonyms:
CATK_HUMAN CTSO Cathepsin O Cathepsin X
Type:
Enzyme
Mol. Mass.:
36975.68
Organism:
Homo sapiens (Human)
Description:
P43235
Residue:
329
  
Inhibitor
Name:
BDBM19757
Synonyms:
benzyl N-[(1S)-1-{[(1S)-1-cyano-2-[4-(trifluoromethyl)phenyl]ethyl]carbamoyl}-3-methylbutyl]carbamate | dipeptidyl nitrile, 5f
Type:
Small organic molecule
Emp. Form.:
C24H26F3N3O3
Mol. Mass.:
461.4767
SMILES:
CC(C)C[C@H](NC(=O)OCc1ccccc1)C(=O)N[C@@H](Cc1ccc(cc1)C(F)(F)F)C#N
:
Substrate
Name:
BDBM19485
Synonyms:
Cbz-Phe-Arg-AMC Z-Phe-Arg-AMC.HCl
Type:
Emp. Form.:
Mol. Mass.:
SMILES:
: