Target
Procathepsin L
Ligand
BDBM19764
Substrate
BDBM19485
Meas. Tech.
Enzyme Inhibition Assay
pH
5.5±n/a
Temperature
295.15±n/a K
IC50
154±n/a nM
Citation
 Altmann, EAichholz, RBetschart, CBuhl, TGreen, JLattmann, RMissbach, M Dipeptide nitrile inhibitors of cathepsin K. Bioorg Med Chem Lett 16:2549-54 (2006)  
Target
Name:
Procathepsin L
Synonyms:
CATL1_HUMAN CTSL CTSL1 Cathepsin L Cathepsin L1 heavy chain MEP cathepsin L preproprotein
Type:
Enzyme
Mol. Mass.:
37557.19
Organism:
Homo sapiens (Human)
Description:
Purchased from Calbiochem (San Diego, CA).
Residue:
333
  
Inhibitor
Name:
BDBM19764
Synonyms:
(2S)-N-[(1R)-2-(benzyloxy)-1-cyanoethyl]-2-(1H-indol-2-ylformamido)-4-methylpentanamide | dipeptidyl nitrile, 16e
Type:
Small organic molecule
Emp. Form.:
C25H28N4O3
Mol. Mass.:
432.5148
SMILES:
CC(C)C[C@H](NC(=O)c1cc2ccccc2[nH]1)C(=O)N[C@@H](COCc1ccccc1)C#N
:
Substrate
Name:
BDBM19485
Synonyms:
Cbz-Phe-Arg-AMC Z-Phe-Arg-AMC.HCl
Type:
Emp. Form.:
Mol. Mass.:
SMILES:
: