Target
Cathepsin S
Ligand
BDBM19761
Substrate
BDBM19963
Meas. Tech.
Enzyme Inhibition Assay
IC50
180±n/a nM
Citation
 Altmann, EAichholz, RBetschart, CBuhl, TGreen, JLattmann, RMissbach, M Dipeptide nitrile inhibitors of cathepsin K. Bioorg Med Chem Lett 16:2549-54 (2006)  
Target
Name:
Cathepsin S
Synonyms:
CATS_HUMAN Cathepsin S (Cat S) | cathepsin S preproprotein
Type:
Protein
Mol. Mass.:
37507.38
Organism:
Homo sapiens (Human)
Description:
P25774
Residue:
331
  
Inhibitor
Name:
BDBM19761
Synonyms:
(2S)-N-[(1R)-2-(benzyloxy)-1-cyanoethyl]-4-methyl-2-{1-[4-(pyridin-4-yl)piperazin-1-yl]acetamido}pentanamide | dipeptidyl nitrile, 16b
Type:
Small organic molecule
Emp. Form.:
C27H36N6O3
Mol. Mass.:
492.6131
SMILES:
CC(C)C[C@H](NC(=O)CN1CCN(CC1)c1ccncc1)C(=O)N[C@@H](COCc1ccccc1)C#N
:
Substrate
Name:
BDBM19963
Synonyms:
Cbz-Leu-Leu-Arg-AMC Z-Leu-Leu-Arg-AMC
Type:
Emp. Form.:
Mol. Mass.:
SMILES:
: