Target
Cathepsin K
Ligand
BDBM19774
Substrate
BDBM19485
Meas. Tech.
Enzyme Inhibition Assay
pH
5.5±n/a
Temperature
295.15±n/a K
Ki
29±n/a nM
Citation
 Yamashita, DSMarquis, RWXie, RNidamarthy, SDOh, HJJeong, JUErhard, KFWard, KWRoethke, TJSmith, BRCheng, HYGeng, XLin, FOffen, PHWang, BNevins, NHead, MSHaltiwanger, RCNarducci Sarjeant, AALiable-Sands, LMZhao, BSmith, WWJanson, CAGao, ETomaszek, TMcQueney, MJames, IEGress, CJZembryki, DLLark, MWVeber, DF Structure activity relationships of 5-, 6-, and 7-methyl-substituted azepan-3-one cathepsin K inhibitors. J Med Chem 49:1597-612 (2006)  
Target
Name:
Cathepsin K
Synonyms:
CATK_HUMAN CTSO Cathepsin O Cathepsin X
Type:
Enzyme
Mol. Mass.:
36975.68
Organism:
Homo sapiens (Human)
Description:
P43235
Residue:
329
  
Inhibitor
Name:
BDBM19774
Synonyms:
(2S)-2-(1-benzofuran-2-ylformamido)-4-methyl-N-[(4S,6R)-6-methyl-3-oxo-1-(pyridine-2-sulfonyl)azepan-4-yl]pentanamide | Azepan-3-one compound 6
Type:
Small organic molecule
Emp. Form.:
C27H32N4O6S
Mol. Mass.:
540.631
SMILES:
CC(C)C[C@H](NC(=O)c1cc2ccccc2o1)C(=O)N[C@H]1C[C@@H](C)CN(CC1=O)S(=O)(=O)c1ccccn1
:
Substrate
Name:
BDBM19485
Synonyms:
Cbz-Phe-Arg-AMC Z-Phe-Arg-AMC.HCl
Type:
Emp. Form.:
Mol. Mass.:
SMILES:
: