Target
Procathepsin L
Ligand
BDBM19857
Substrate
BDBM19480
Meas. Tech.
Enzyme Inhibition Assay and Whole Cell Enzyme Occupancy Assay
pH
5.5±n/a
Temperature
295.15±n/a K
IC50
24000±3000 nM
EC50
>10000±n/a nM
Citation
 Falgueyret, JPDesmarais, SOballa, RBlack, WCCromlish, WKhougaz, KLamontagne, SMassé, FRiendeau, DToulmond, SPercival, MD Lysosomotropism of basic cathepsin K inhibitors contributes to increased cellular potencies against off-target cathepsins and reduced functional selectivity. J Med Chem 48:7535-43 (2005)  
Target
Name:
Procathepsin L
Synonyms:
CATL1_HUMAN CTSL CTSL1 Cathepsin L Cathepsin L1 heavy chain MEP cathepsin L preproprotein
Type:
Enzyme
Mol. Mass.:
37557.19
Organism:
Homo sapiens (Human)
Description:
Purchased from Calbiochem (San Diego, CA).
Residue:
333
  
Inhibitor
Name:
BDBM19857
Synonyms:
N-{1-[(cyanomethyl)carbamoyl]cyclohexyl}-4-[2-(morpholin-4-yl)-1,3-thiazol-4-yl]benzamide | aryl-morpholino-containing analogue, 12
Type:
Small organic molecule
Emp. Form.:
C23H27N5O3S
Mol. Mass.:
453.557
SMILES:
O=C(NC1(CCCCC1)C(=O)NCC#N)c1ccc(cc1)-c1csc(n1)N1CCOCC1
:
Substrate
Name:
BDBM19480
Synonyms:
Cbz-Leu-Arg-AMC Z-Leu-Arg-AMC
Type:
Emp. Form.:
Mol. Mass.:
SMILES:
: