Target
Cathepsin S
Ligand
BDBM19855
Substrate
BDBM19490
Meas. Tech.
Enzyme Inhibition Assay and Whole Cell Enzyme Occupancy Assay
pH
6.5±n/a
Temperature
295.15±n/a K
IC50
65000±4000 nM
EC50
2900±1300 nM
Citation
 Falgueyret, JPDesmarais, SOballa, RBlack, WCCromlish, WKhougaz, KLamontagne, SMassé, FRiendeau, DToulmond, SPercival, MD Lysosomotropism of basic cathepsin K inhibitors contributes to increased cellular potencies against off-target cathepsins and reduced functional selectivity. J Med Chem 48:7535-43 (2005)  
Target
Name:
Cathepsin S
Synonyms:
CATS_HUMAN Cathepsin S (Cat S) | cathepsin S preproprotein
Type:
Protein
Mol. Mass.:
37507.38
Organism:
Homo sapiens (Human)
Description:
P25774
Residue:
331
  
Inhibitor
Name:
BDBM19855
Synonyms:
Balicatib N-[1-(cyanomethylcarbamoyl)cyclohexyl]-4-(4-propylpiperazin-1-yl) basic piperazine-containing compound, 10
Type:
Small organic molecule
Emp. Form.:
C23H33N5O2
Mol. Mass.:
411.5404
SMILES:
CCCN1CCN(CC1)c1ccc(cc1)C(=O)NC1(CCCCC1)C(=O)NCC#N
:
Substrate
Name:
BDBM19490
Synonyms:
Cbz-Val-Val-Arg-AMC Z-Val-Val-Arg-AMC
Type:
Emp. Form.:
Mol. Mass.:
SMILES:
: