Target
Cathepsin S
Ligand
BDBM19854
Substrate
BDBM19490
Meas. Tech.
Enzyme Inhibition Assay
IC50
5400±n/a nM
EC50
318±n/a nM
Citation
 Falgueyret, JPDesmarais, SOballa, RBlack, WCCromlish, WKhougaz, KLamontagne, SMassé, FRiendeau, DToulmond, SPercival, MD Lysosomotropism of basic cathepsin K inhibitors contributes to increased cellular potencies against off-target cathepsins and reduced functional selectivity. J Med Chem 48:7535-43 (2005)  
Target
Name:
Cathepsin S
Synonyms:
CATS_MOUSE Ctss
Type:
Enzyme
Mol. Mass.:
38476.67
Organism:
Mus musculus (Mouse)
Description:
O70370
Residue:
340
  
Inhibitor
Name:
BDBM19854
Synonyms:
CHEMBL426819 N-{1-[(cyanomethyl)carbamoyl]cyclohexyl}-4-[2-(4-methylpiperazin-1-yl)-1,3-thiazol-4-yl]benzamide | basic piperazine-containing compound, 1
Type:
Small organic molecule
Emp. Form.:
C24H30N6O2S
Mol. Mass.:
466.599
SMILES:
CN1CCN(CC1)c1nc(cs1)-c1ccc(cc1)C(=O)NC1(CCCCC1)C(=O)NCC#N
:
Substrate
Name:
BDBM19490
Synonyms:
Cbz-Val-Val-Arg-AMC Z-Val-Val-Arg-AMC
Type:
Emp. Form.:
Mol. Mass.:
SMILES:
: