Target
Large envelope protein
Ligand
BDBM246827
Substrate
Meas. Tech.
HBsAg assay
Temperature
298.15±n/a K
IC50
10.00±n/a nM
Comments
extracted
Citation
 Han, XJiang, MWang, YYang, S Tetracyclic 4-oxo-pyridine-3-carboxylic acid derivatives for the treatment and prophylaxis of hepatitis B virus infection US Patent  US10053461 Publication Date 8/21/2018 
Target
Name:
Large envelope protein
Synonyms:
HBSAG_HBVD3 | S
Type:
Mol. Mass.:
42772.52
Organism:
Hepatitis B virus
Description:
P03138
Residue:
389
  
Inhibitor
Name:
BDBM246827
Synonyms:
Cis-11-(4-ethoxy-4-oxobutoxy)-10-methoxy-3,3-dimethyl-7-oxo-1,2,3,3a,7,12b-hexahydrocyclopenta[c]pyrido[2,1-a]isoquinoline-6-carboxylic acid | US10053461, 18
Type:
Small organic molecule
Emp. Form.:
C26H31NO7
Mol. Mass.:
469.5268
SMILES:
CCOC(=O)CCCOc1cc2[C@H]3CCC(C)(C)[C@H]3n3cc(C(O)=O)c(=O)cc3-c2cc1OC
: