Target
Large envelope protein
Ligand
BDBM246832
Substrate
Meas. Tech.
HBsAg assay
Temperature
298.15±n/a K
IC50
2.00±n/a nM
Comments
extracted
Citation
 Han, XJiang, MWang, YYang, S Tetracyclic 4-oxo-pyridine-3-carboxylic acid derivatives for the treatment and prophylaxis of hepatitis B virus infection US Patent  US10053461 Publication Date 8/21/2018 
Target
Name:
Large envelope protein
Synonyms:
HBSAG_HBVD3 | S
Type:
Mol. Mass.:
42772.52
Organism:
Hepatitis B virus
Description:
P03138
Residue:
389
  
Inhibitor
Name:
BDBM246832
Synonyms:
Cis-11-((6-((tert-butoxycarbonyl)amino)hexyl)oxy)-10-methoxy-3,3-dimethyl-7-oxo-1,2,3,3a,7,12b-hexahydrocyclopenta[c]pyrido[2,1-a]isoquinoline-6-carboxylic acid | US10053461, 23
Type:
Small organic molecule
Emp. Form.:
C31H42N2O7
Mol. Mass.:
554.6744
SMILES:
COc1cc-2c(cc1OCCCCCCNC(=O)OC(C)(C)C)[C@H]1CCC(C)(C)[C@H]1n1cc(C(O)=O)c(=O)cc-21
: