Target
Large envelope protein
Ligand
BDBM246835
Substrate
Meas. Tech.
HBsAg assay
Temperature
298.15±n/a K
IC50
2.00±n/a nM
Comments
extracted
Citation
 Han, XJiang, MWang, YYang, S Tetracyclic 4-oxo-pyridine-3-carboxylic acid derivatives for the treatment and prophylaxis of hepatitis B virus infection US Patent  US10053461 Publication Date 8/21/2018 
Target
Name:
Large envelope protein
Synonyms:
HBSAG_HBVD3 | S
Type:
Mol. Mass.:
42772.52
Organism:
Hepatitis B virus
Description:
P03138
Residue:
389
  
Inhibitor
Name:
BDBM246835
Synonyms:
Cis-10-methoxy-3,3-dimethyl-11-((6-(methylsulfonamido)hexyl)oxy)-7-oxo-1,2,3,3a,7,12b-hexahydrocyclopenta[c]pyrido[2,1-a]isoquinoline-6-carboxylic acid | US10053461, 26
Type:
Small organic molecule
Emp. Form.:
C27H36N2O7S
Mol. Mass.:
532.649
SMILES:
COc1cc-2c(cc1OCCCCCCNS(C)(=O)=O)[C@H]1CCC(C)(C)[C@H]1n1cc(C(O)=O)c(=O)cc-21
: