Target
Large envelope protein
Ligand
BDBM246850
Substrate
Meas. Tech.
HBsAg assay
Temperature
298.15±n/a K
IC50
<1.60±n/a nM
Comments
extracted
Citation
 Han, XJiang, MWang, YYang, S Tetracyclic 4-oxo-pyridine-3-carboxylic acid derivatives for the treatment and prophylaxis of hepatitis B virus infection US Patent  US10053461 Publication Date 8/21/2018 
Target
Name:
Large envelope protein
Synonyms:
HBSAG_HBVD3 | S
Type:
Mol. Mass.:
42772.52
Organism:
Hepatitis B virus
Description:
P03138
Residue:
389
  
Inhibitor
Name:
BDBM246850
Synonyms:
Cis-10-methoxy-3,3-dimethyl-7-oxo-11-(pyrrolidin-1-yl)-1,2,3,3a,7,12b-hexahydrocyclopenta[c]pyrido[2,1-a]isoquinoline-6-carboxylic acid | US10053461, 41
Type:
Small organic molecule
Emp. Form.:
C24H28N2O4
Mol. Mass.:
408.4901
SMILES:
COc1cc-2c(cc1N1CCCC1)[C@H]1CCC(C)(C)[C@H]1n1cc(C(O)=O)c(=O)cc-21
: